Gentoo Forums
Gentoo Forums
Gentoo Forums
Quick Search: in
dev-util/sysprof-3.37.2::gnome-next fails to build
View unanswered posts
View posts from last 24 hours

 
Reply to topic    Gentoo Forums Forum Index Unsupported Software
View previous topic :: View next topic  
Author Message
sager58
n00b
n00b


Joined: 03 Jan 2005
Posts: 12
Location: Cornwall, NY

PostPosted: Mon Aug 17, 2020 3:39 am    Post subject: dev-util/sysprof-3.37.2::gnome-next fails to build Reply with quote

Hi,
This pacakage was recently bumped up a version, and I currently can not get to build on my LTO system. The error when the build fails indicates that a function is not "inlinable". I've tried rebuilding glibc (the provider of the header file in the error message), and I've tried "emerge -ave dev-util/sysprof" with no success.

Any suggestions as to how to over come this build failure, or indication that it's appropriate to open a bug/issue with the gnome-next repository or sysprof upstream maintainers is appreciated. Emerge --info and build log excerpts are below.

Thanks,
Frank

emerge --info
Code:
Portage 3.0.2 (python 3.8.5-final-0, default/linux/amd64/17.1/desktop/gnome/systemd, gcc-10.2.0, glibc-2.32, 5.8.1-gentoo-x86_64 x86_64)
=================================================================
System uname: Linux-5.8.1-gentoo-x86_64-x86_64-Intel-R-_Core-TM-_i7-1065G7_CPU_@_1.30GHz-with-glibc2.2.5
KiB Mem:    16149764 total,   3984616 free
KiB Swap:   18874364 total,  18710780 free
Timestamp of repository gentoo: Mon, 17 Aug 2020 01:45:01 +0000
Head commit of repository gentoo: 1299ae62ef26c9fc6227fcaa1fa820b725dc18ac
Head commit of repository sakaki-tools: 3bebe586b95f78439796f88abaa86c586d61f830

sh bash 5.0_p18
ld GNU ld (Gentoo 2.34 p6) 2.34.0
ccache version 3.7.11 [enabled]
app-shells/bash:          5.0_p18::gentoo
dev-java/java-config:     2.3.1::gentoo
dev-lang/perl:            5.30.3-r1::gentoo
dev-lang/python:          2.7.18-r100::lto-overlay, 3.7.8-r3::lto-overlay, 3.8.5-r1::lto-overlay, 3.9.0_rc1::gentoo
dev-util/ccache:          3.7.11::gentoo
dev-util/cmake:           3.18.1::gentoo
sys-apps/baselayout:      2.7::gentoo
sys-apps/sandbox:         2.20::gentoo
sys-devel/autoconf:       2.13-r1::gentoo, 2.69-r5::gentoo
sys-devel/automake:       1.16.2::gentoo
sys-devel/binutils:       2.34-r2::gentoo
sys-devel/gcc:            10.2.0::gentoo
sys-devel/gcc-config:     2.3.1::gentoo
sys-devel/libtool:        2.4.6-r6::gentoo
sys-devel/make:           4.3::gentoo
sys-kernel/linux-headers: 5.8::gentoo (virtual/os-headers)
sys-libs/glibc:           2.32::gentoo
Repositories:

gentoo
    location: /var/db/repos/gentoo
    sync-type: rsync
    sync-uri: rsync://rsync.us.gentoo.org/gentoo-portage
    priority: -1000
    sync-rsync-verify-jobs: 1
    sync-rsync-verify-metamanifest: yes
    sync-rsync-verify-max-age: 24
    sync-rsync-extra-opts:

localrepo
    location: /var/db/repos/localrepo
    masters: gentoo

gnome-next
    location: /var/lib/layman/gnome-next
    masters: gentoo
    priority: 50

lto-overlay
    location: /var/lib/layman/lto-overlay
    masters: gentoo mv
    priority: 50

mv
    location: /var/lib/layman/mv
    masters: gentoo
    priority: 50

sakaki-tools
    location: /var/db/repos/sakaki-tools
    sync-type: git
    sync-uri: https://github.com/sakaki-/sakaki-tools.git
    masters: gentoo
    priority: 50

ACCEPT_KEYWORDS="amd64 ~amd64"
ACCEPT_LICENSE="@FREE CC-Sampling-Plus-1.0"
CBUILD="x86_64-pc-linux-gnu"
CFLAGS="-march=icelake-client -O3 -fgraphite-identity -floop-nest-optimize -fdevirtualize-at-ltrans -fipa-pta -fno-semantic-interposition -flto=auto -fuse-linker-plugin -pipe -mabm -mavx256-split-unaligned-load -mavx256-split-unaligned-store -mno-clwb -falign-functions=32"
CHOST="x86_64-pc-linux-gnu"
CONFIG_PROTECT="/etc /usr/share/gnupg/qualified.txt"
CONFIG_PROTECT_MASK="/etc/ca-certificates.conf /etc/dconf /etc/env.d /etc/fonts/fonts.conf /etc/gconf /etc/gentoo-release /etc/revdep-rebuild /etc/sandbox.d /etc/terminfo"
CXXFLAGS="-march=icelake-client -O3 -fgraphite-identity -floop-nest-optimize -fdevirtualize-at-ltrans -fipa-pta -fno-semantic-interposition -flto=auto -fuse-linker-plugin -pipe -mabm -mavx256-split-unaligned-load -mavx256-split-unaligned-store -mno-clwb -falign-functions=32"
DISTDIR="/var/cache/distfiles"
EMERGE_DEFAULT_OPTS="--jobs=9 --load-average=8"
ENV_UNSET="DBUS_SESSION_BUS_ADDRESS DISPLAY GOBIN GOPATH PERL5LIB PERL5OPT PERLPREFIX PERL_CORE PERL_MB_OPT PERL_MM_OPT XAUTHORITY XDG_CACHE_HOME XDG_CONFIG_HOME XDG_DATA_HOME XDG_RUNTIME_DIR"
FCFLAGS="-march=icelake-client -O3 -fgraphite-identity -floop-nest-optimize -fdevirtualize-at-ltrans -fipa-pta -fno-semantic-interposition -flto=auto -fuse-linker-plugin -pipe -mabm -mavx256-split-unaligned-load -mavx256-split-unaligned-store -mno-clwb -falign-functions=32"
FEATURES="assume-digests binpkg-docompress binpkg-dostrip binpkg-logs buildpkg ccache config-protect-if-modified distlocks ebuild-locks fixlafiles ipc-sandbox merge-sync multilib-strict network-sandbox news parallel-fetch pid-sandbox preserve-libs protect-owned qa-unresolved-soname-deps sandbox sfperms split-elog strict unknown-features-warn unmerge-logs unmerge-orphans userfetch userpriv usersandbox usersync xattr"
FFLAGS="-march=icelake-client -O3 -fgraphite-identity -floop-nest-optimize -fdevirtualize-at-ltrans -fipa-pta -fno-semantic-interposition -flto=auto -fuse-linker-plugin -pipe -mabm -mavx256-split-unaligned-load -mavx256-split-unaligned-store -mno-clwb -falign-functions=32"
GENTOO_MIRRORS="http://gentoo.mirrors.tds.net/gentoo ftp://ftp.ussg.iu.edu/pub/linux/gentoo http://gentoo.ussg.indiana.edu/"
LANG="en_US.utf8"
LDFLAGS="-Wl,-O1 -Wl,--as-needed"
MAKEOPTS="-j9 -l8"
PKGDIR="/var/cache/binpkgs"
PORTAGE_CONFIGROOT="/"
PORTAGE_RSYNC_OPTS="--recursive --links --safe-links --perms --times --omit-dir-times --compress --force --whole-file --delete --stats --human-readable --timeout=180 --exclude=/distfiles --exclude=/local --exclude=/packages --exclude=/.git"
PORTAGE_TMPDIR="/var/tmp"
USE="X a52 aac acl acpi alsa amd64 berkdb bluetooth branding bzip2 cairo cdda cli colord crypt cups dbus dri dts dvdr eds emboss encode evo exif flac fortran gdbm gif gnome gnome-keyring gnome-online-accounts gpm gstreamer gtk iconv icu introspection ipv6 jpeg lcms ldap libglvnd libnotify libsecret libtirpc mad mng mp3 mp4 mpeg multilib nautilus ncurses networkmanager nls nptl offensive ogg opengl openmp pam pango pcre pdf png policykit ppds pulseaudio qt5 readline sdl seccomp spell split-usr ssl startup-notification svg systemd tcpd tiff tracker truetype udev udisks unicode upower usb vaapi vorbis wayland wxwidgets x264 xattr xcb xml xv xvid zlib zsh-completion" ABI_X86="64" ADA_TARGET="gnat_2018" ALSA_CARDS="ali5451 als4000 atiixp atiixp-modem bt87x ca0106 cmipci emu10k1x ens1370 ens1371 es1938 es1968 fm801 hda-intel intel8x0 intel8x0m maestro3 trident usb-audio via82xx via82xx-modem ymfpci" APACHE2_MODULES="authn_core authz_core socache_shmcb unixd actions alias auth_basic authn_alias authn_anon authn_dbm authn_default authn_file authz_dbm authz_default authz_groupfile authz_host authz_owner authz_user autoindex cache cgi cgid dav dav_fs dav_lock deflate dir disk_cache env expires ext_filter file_cache filter headers include info log_config logio mem_cache mime mime_magic negotiation rewrite setenvif speling status unique_id userdir usertrack vhost_alias" CALLIGRA_FEATURES="karbon sheets words" COLLECTD_PLUGINS="df interface irq load memory rrdtool swap syslog" CPU_FLAGS_X86="aes avx avx2 avx512f avx512dq avx512cd avx512bw avx512vl avx512vbmi f16c fma3 mmx mmxext pclmul popcnt sha sse sse2 sse3 sse4_1 sse4_2 ssse3" ELIBC="glibc" GPSD_PROTOCOLS="ashtech aivdm earthmate evermore fv18 garmin garmintxt gpsclock greis isync itrax mtk3301 nmea ntrip navcom oceanserver oldstyle oncore rtcm104v2 rtcm104v3 sirf skytraq superstar2 timing tsip tripmate tnt ublox ubx" INPUT_DEVICES="libinput evdev" KERNEL="linux" L10N="en en-US" LCD_DEVICES="bayrad cfontz cfontz633 glk hd44780 lb216 lcdm001 mtxorb ncurses text" LIBREOFFICE_EXTENSIONS="presenter-console presenter-minimizer" LLVM_TARGETS="X86 BPF" OFFICE_IMPLEMENTATION="libreoffice" PHP_TARGETS="php7-2 php7-3" POSTGRES_TARGETS="postgres10 postgres11" PYTHON_SINGLE_TARGET="python3_8" PYTHON_TARGETS="python3_7 python3_8 python3_9" RUBY_TARGETS="ruby27" USERLAND="GNU" VIDEO_CARDS="intel i965 iris" XTABLES_ADDONS="quota2 psd pknock lscan length2 ipv4options ipset ipp2p iface geoip fuzzy condition tee tarpit sysrq steal rawnat logmark ipmark dhcpmac delude chaos account"
Unset:  CC, CPPFLAGS, CTARGET, CXX, INSTALL_MASK, LC_ALL, LINGUAS, PORTAGE_BINHOST, PORTAGE_BUNZIP2_COMMAND, PORTAGE_COMPRESS, PORTAGE_COMPRESS_FLAGS, PORTAGE_RSYNC_EXTRA_OPTS


Build Log excerpts
Code:
*** Resuming merge...
>>> Verifying ebuild manifests
>>> Emerging (1 of 4) dev-util/sysprof-3.37.2::gnome-next
>>> Failed to emerge dev-util/sysprof-3.37.2, Log file:
>>>  '/var/tmp/portage/dev-util/sysprof-3.37.2/temp/build.log'
>>> Jobs: 0 of 4 complete, 1 failed                 Load avg: 1.88, 1.06, 0.56
 * Package:    dev-util/sysprof-3.37.2
 * Repository: gnome-next
 * Maintainer: gnome@gentoo.org
 * USE:        abi_x86_64 amd64 elibc_glibc gtk kernel_linux userland_GNU
 * FEATURES:   ccache network-sandbox preserve-libs sandbox userpriv usersandbox
 * FEATURES='assume-digests binpkg-docompress binpkg-dostrip binpkg-logs buildpkg ccache config-protect-if-modified distlocks ebuild-locks fixlafiles ipc-sandbox merge-sync multilib-strict network-sandbox news parallel-fetch pid-sandbox preserve-libs protect-owned qa-unresolved-soname-deps sandbox sfperms split-elog strict unknown-features-warn unmerge-logs unmerge-orphans userfetch userpriv usersandbox usersync xattr'
 * CFLAGS='-march=icelake-client -O3 -fgraphite-identity -floop-nest-optimize -fdevirtualize-at-ltrans -fipa-pta -fno-semantic-interposition -flto=auto -fuse-linker-plugin -pipe -mabm -mavx256-split-unaligned-load -mavx256-split-unaligned-store -mno-clwb -falign-functions=32 -Wl,-O1 -Wl,--as-needed'
 * CXXFLAGS='-march=icelake-client -O3 -fgraphite-identity -floop-nest-optimize -fdevirtualize-at-ltrans -fipa-pta -fno-semantic-interposition -flto=auto -fuse-linker-plugin -pipe -mabm -mavx256-split-unaligned-load -mavx256-split-unaligned-store -mno-clwb -falign-functions=32 -Wl,-O1 -Wl,--as-needed'
 * FFLAGS='-march=icelake-client -O3 -fgraphite-identity -floop-nest-optimize -fdevirtualize-at-ltrans -fipa-pta -fno-semantic-interposition -flto=auto -fuse-linker-plugin -pipe -mabm -mavx256-split-unaligned-load -mavx256-split-unaligned-store -mno-clwb -falign-functions=32 -Wl,-O1 -Wl,--as-needed'
 * FCFLAGS='-march=icelake-client -O3 -fgraphite-identity -floop-nest-optimize -fdevirtualize-at-ltrans -fipa-pta -fno-semantic-interposition -flto=auto -fuse-linker-plugin -pipe -mabm -mavx256-split-unaligned-load -mavx256-split-unaligned-store -mno-clwb -falign-functions=32 -Wl,-O1 -Wl,--as-needed'
 * F77FLAGS='-march=icelake-client -O3 -fgraphite-identity -floop-nest-optimize -fdevirtualize-at-ltrans -fipa-pta -fno-semantic-interposition -flto=auto -fuse-linker-plugin -pipe -mabm -mavx256-split-unaligned-load -mavx256-split-unaligned-store -mno-clwb -falign-functions=32 -Wl,-O1 -Wl,--as-needed'
 * LDFLAGS='-Wl,-O1 -Wl,--as-needed -march=icelake-client -O3 -fgraphite-identity -floop-nest-optimize -fdevirtualize-at-ltrans -fipa-pta -fno-semantic-interposition -flto=auto -fuse-linker-plugin -pipe -mabm -mavx256-split-unaligned-load -mavx256-split-unaligned-store -mno-clwb -falign-functions=32'
 * MAKEOPTS=' -j1'
 * gcc (Gentoo 10.2.0 p1) 10.2.0
 * g++ (Gentoo 10.2.0 p1) 10.2.0
 * GNU ld (Gentoo 2.34 p6) 2.34.0
 * Linux TARDIS1968 5.8.1-gentoo-x86_64 #8 SMP PREEMPT Sat Aug 15 14:30:39 EDT 2020 x86_64 Intel(R) Core(TM) i7-1065G7 CPU @ 1.30GHz GenuineIntel GNU/Linux
dev-util/sysprof: 1 minute, 57 seconds average for 5 merges
2020-07-05T20:50:08 >>> dev-util/sysprof: 1 minute, 39 seconds
2020-07-08T00:51:39 >>> dev-util/sysprof: 3 minutes, 7 seconds
2020-08-02T00:12:52 >>> dev-util/sysprof: 2 minutes, 5 seconds
2020-08-13T21:47:08 >>> dev-util/sysprof: 1 minute, 16 seconds
2020-08-16T09:16:24 >>> dev-util/sysprof: 1 minute, 42 seconds
>>> Unpacking source...
>>> Unpacking sysprof-3.37.2.tar.xz to /var/tmp/portage/dev-util/sysprof-3.37.2/work
>>> Source unpacked in /var/tmp/portage/dev-util/sysprof-3.37.2/work
>>> Preparing source in /var/tmp/portage/dev-util/sysprof-3.37.2/work/sysprof-3.37.2 ...
>>> Source prepared.
>>> Configuring source in /var/tmp/portage/dev-util/sysprof-3.37.2/work/sysprof-3.37.2 ...
>>> Source configured.
>>> Compiling source in /var/tmp/portage/dev-util/sysprof-3.37.2/work/sysprof-3.37.2 ...
ninja -v -j1 -l0 -C /var/tmp/portage/dev-util/sysprof-3.37.2/work/sysprof-3.37.2-build
ninja: Entering directory `/var/tmp/portage/dev-util/sysprof-3.37.2/work/sysprof-3.37.2-build'
... ... ...

[94/225] x86_64-pc-linux-gnu-g++  -o src/libsysprof/libsysprof-4.so src/libsysprof/libsysprof-4.so.p/meson-generated_.._.._ipc-service.c.o src/libsysprof/libsysprof-4.so.p/sysprof-battery-source.c.o src/libsysprof/libsysprof-4.so.p/sysprof-callgraph-profile.c.o src/libsysprof/libsysprof-4.so.p/sysprof-capture-gobject.c.o src/libsysprof/libsysprof-4.so.p/sysprof-capture-symbol-resolver.c.o src/libsysprof/libsysprof-4.so.p/sysprof-control-source.c.o src/libsysprof/libsysprof-4.so.p/sysprof-diskstat-source.c.o src/libsysprof/libsysprof-4.so.p/sysprof-elf-symbol-resolver.c.o src/libsysprof/libsysprof-4.so.p/sysprof-gjs-source.c.o src/libsysprof/libsysprof-4.so.p/sysprof-governor-source.c.o src/libsysprof/libsysprof-4.so.p/sysprof-hostinfo-source.c.o src/libsysprof/libsysprof-4.so.p/sysprof-jitmap-symbol-resolver.c.o src/libsysprof/libsysprof-4.so.p/sysprof-kernel-symbol.c.o src/libsysprof/libsysprof-4.so.p/sysprof-kernel-symbol-resolver.c.o src/libsysprof/libsysprof-4.so.p/sysprof-local-profiler.c.o src/libsysprof/libsysprof-4.so.p/sysprof-memprof-profile.c.o src/libsysprof/libsysprof-4.so.p/sysprof-memprof-source.c.o src/libsysprof/libsysprof-4.so.p/sysprof-netdev-source.c.o src/libsysprof/libsysprof-4.so.p/sysprof-preload-source.c.o src/libsysprof/libsysprof-4.so.p/sysprof-process-model.c.o src/libsysprof/libsysprof-4.so.p/sysprof-process-model-item.c.o src/libsysprof/libsysprof-4.so.p/sysprof-profile.c.o src/libsysprof/libsysprof-4.so.p/sysprof-profiler.c.o src/libsysprof/libsysprof-4.so.p/sysprof-proxy-source.c.o src/libsysprof/libsysprof-4.so.p/sysprof-selection.c.o src/libsysprof/libsysprof-4.so.p/sysprof-source.c.o src/libsysprof/libsysprof-4.so.p/sysprof-spawnable.c.o src/libsysprof/libsysprof-4.so.p/sysprof-symbol-resolver.c.o src/libsysprof/libsysprof-4.so.p/sysprof-symbols-source.c.o src/libsysprof/libsysprof-4.so.p/sysprof-tracefd-source.c.o src/libsysprof/libsysprof-4.so.p/.._libsysprof-capture_mapped-ring-buffer.c.o src/libsysprof/libsysprof-4.so.p/.._libsysprof-capture_sysprof-address.c.o src/libsysprof/libsysprof-4.so.p/.._libsysprof-capture_sysprof-capture-condition.c.o src/libsysprof/libsysprof-4.so.p/.._libsysprof-capture_sysprof-capture-cursor.c.o src/libsysprof/libsysprof-4.so.p/.._libsysprof-capture_sysprof-capture-reader.c.o src/libsysprof/libsysprof-4.so.p/.._libsysprof-capture_sysprof-capture-util.c.o src/libsysprof/libsysprof-4.so.p/.._libsysprof-capture_sysprof-capture-writer.c.o src/libsysprof/libsysprof-4.so.p/.._libsysprof-capture_sysprof-capture-writer-cat.c.o src/libsysprof/libsysprof-4.so.p/.._libsysprof-capture_sysprof-collector.c.o src/libsysprof/libsysprof-4.so.p/.._libsysprof-capture_sysprof-clock.c.o src/libsysprof/libsysprof-4.so.p/.._libsysprof-capture_sysprof-platform.c.o src/libsysprof/libsysprof-4.so.p/sysprof-memory-source.c.o src/libsysprof/libsysprof-4.so.p/sysprof-perf-counter.c.o src/libsysprof/libsysprof-4.so.p/sysprof-perf-source.c.o src/libsysprof/libsysprof-4.so.p/sysprof-proc-source.c.o src/libsysprof/libsysprof-4.so.p/binfile.c.o src/libsysprof/libsysprof-4.so.p/demangle.cpp.o src/libsysprof/libsysprof-4.so.p/elfparser.c.o src/libsysprof/libsysprof-4.so.p/mapped-ring-buffer-source.c.o src/libsysprof/libsysprof-4.so.p/sysprof-flatpak.c.o src/libsysprof/libsysprof-4.so.p/sysprof-helpers.c.o src/libsysprof/libsysprof-4.so.p/sysprof-kallsyms.c.o src/libsysprof/libsysprof-4.so.p/sysprof-line-reader.c.o src/libsysprof/libsysprof-4.so.p/sysprof-map-lookaside.c.o src/libsysprof/libsysprof-4.so.p/sysprof-mountinfo.c.o src/libsysprof/libsysprof-4.so.p/sysprof-podman.c.o src/libsysprof/libsysprof-4.so.p/sysprof-polkit.c.o src/libsysprof/libsysprof-4.so.p/sysprof-symbol-map.c.o src/libsysprof/libsysprof-4.so.p/.._stackstash.c.o src/libsysprof/libsysprof-4.so.p/.._helpers.c.o -Wl,--as-needed -Wl,--no-undefined -shared -fPIC -Wl,--start-group -Wl,-soname,libsysprof-4.so -Wl,--whole-archive src/libsysprof/librax.a -Wl,--no-whole-archive -march=icelake-client -O3 -fgraphite-identity -floop-nest-optimize -fdevirtualize-at-ltrans -fipa-pta -fno-semantic-interposition -flto=auto -fuse-linker-plugin -pipe -mabm -mavx256-split-unaligned-load -mavx256-split-unaligned-store -mno-clwb -falign-functions=32 -Wl,-O1 -Wl,--as-needed -Wl,-O1 -Wl,--as-needed -march=icelake-client -O3 -fgraphite-identity -floop-nest-optimize -fdevirtualize-at-ltrans -fipa-pta -fno-semantic-interposition -flto=auto -fuse-linker-plugin -mabm -mavx256-split-unaligned-load -mavx256-split-unaligned-store -mno-clwb -falign-functions=32 -pthread /usr/lib64/libgio-2.0.so /usr/lib64/libgobject-2.0.so /usr/lib64/libglib-2.0.so /usr/lib64/libpolkit-gobject-1.so -lstdc++ -Wl,--end-group
[95/225] /usr/lib/python-exec/python3.8/meson --internal symbolextractor /var/tmp/portage/dev-util/sysprof-3.37.2/work/sysprof-3.37.2-build src/libsysprof/libsysprof-4.so src/libsysprof/libsysprof-4.so src/libsysprof/libsysprof-4.so.p/libsysprof-4.so.symbols
[96/225] x86_64-pc-linux-gnu-gcc  -o src/libsysprof/preload/libsysprof-speedtrack-4.so src/libsysprof/preload/libsysprof-speedtrack-4.so.p/sysprof-speedtrack-collector.c.o -Wl,--as-needed -Wl,--no-undefined -shared -fPIC -Wl,--start-group -Wl,-soname,libsysprof-speedtrack-4.so -Wl,--whole-archive src/libsysprof-capture/libsysprof-capture-4.a -Wl,--no-whole-archive -Wl,-z,relro -Wl,-z,now -Wl,-Bsymbolic -fno-plt -Wl,-z,relro -Wl,-z,defs -Wl,-z,now -march=icelake-client -O3 -fgraphite-identity -floop-nest-optimize -fdevirtualize-at-ltrans -fipa-pta -fno-semantic-interposition -flto=auto -fuse-linker-plugin -pipe -mabm -mavx256-split-unaligned-load -mavx256-split-unaligned-store -mno-clwb -falign-functions=32 -Wl,-O1 -Wl,--as-needed -Wl,-O1 -Wl,--as-needed -march=icelake-client -O3 -fgraphite-identity -floop-nest-optimize -fdevirtualize-at-ltrans -fipa-pta -fno-semantic-interposition -flto=auto -fuse-linker-plugin -mabm -mavx256-split-unaligned-load -mavx256-split-unaligned-store -mno-clwb -falign-functions=32 /usr/lib64/libglib-2.0.so -pthread -ldl /usr/lib64/libunwind-generic.so /usr/lib64/libunwind.so -Wl,--end-group
FAILED: src/libsysprof/preload/libsysprof-speedtrack-4.so
x86_64-pc-linux-gnu-gcc  -o src/libsysprof/preload/libsysprof-speedtrack-4.so src/libsysprof/preload/libsysprof-speedtrack-4.so.p/sysprof-speedtrack-collector.c.o -Wl,--as-needed -Wl,--no-undefined -shared -fPIC -Wl,--start-group -Wl,-soname,libsysprof-speedtrack-4.so -Wl,--whole-archive src/libsysprof-capture/libsysprof-capture-4.a -Wl,--no-whole-archive -Wl,-z,relro -Wl,-z,now -Wl,-Bsymbolic -fno-plt -Wl,-z,relro -Wl,-z,defs -Wl,-z,now -march=icelake-client -O3 -fgraphite-identity -floop-nest-optimize -fdevirtualize-at-ltrans -fipa-pta -fno-semantic-interposition -flto=auto -fuse-linker-plugin -pipe -mabm -mavx256-split-unaligned-load -mavx256-split-unaligned-store -mno-clwb -falign-functions=32 -Wl,-O1 -Wl,--as-needed -Wl,-O1 -Wl,--as-needed -march=icelake-client -O3 -fgraphite-identity -floop-nest-optimize -fdevirtualize-at-ltrans -fipa-pta -fno-semantic-interposition -flto=auto -fuse-linker-plugin -mabm -mavx256-split-unaligned-load -mavx256-split-unaligned-store -mno-clwb -falign-functions=32 /usr/lib64/libglib-2.0.so -pthread -ldl /usr/lib64/libunwind-generic.so /usr/lib64/libunwind.so -Wl,--end-group
/usr/include/bits/unistd.h: In function ‘sysprof_capture_writer_add_file_fd’:
/usr/include/bits/unistd.h:36:1: error: inlining failed in call to ‘always_inline’ ‘read.localalias’: function not inlinable
   36 | read (int __fd, void *__buf, size_t __nbytes)
      | ^
/usr/include/bits/unistd.h:46:10: note: called from here
   46 |   return __read_alias (__fd, __buf, __nbytes);
      |          ^
/usr/include/bits/fcntl2.h: In function ‘sysprof_capture_writer_save_as’:
/usr/include/bits/fcntl2.h:41:1: error: inlining failed in call to ‘always_inline’ ‘*open64.localalias’: function not inlinable
   41 | open (const char *__path, int __oflag, ...)
      | ^
/usr/include/bits/fcntl2.h:53:14: note: called from here
   53 |       return __open_alias (__path, __oflag, __va_arg_pack ());
      |              ^
/usr/include/bits/fcntl2.h: In function ‘sysprof_capture_writer_new’:
/usr/include/bits/fcntl2.h:41:1: error: inlining failed in call to ‘always_inline’ ‘*open64.localalias’: function not inlinable
   41 | open (const char *__path, int __oflag, ...)
      | ^
/usr/include/bits/fcntl2.h:53:14: note: called from here
   53 |       return __open_alias (__path, __oflag, __va_arg_pack ());
      |              ^
/usr/include/bits/fcntl2.h: In function ‘sysprof_capture_reader_save_as’:
/usr/include/bits/fcntl2.h:41:1: error: inlining failed in call to ‘always_inline’ ‘*open64.localalias’: function not inlinable
   41 | open (const char *__path, int __oflag, ...)
      | ^
/usr/include/bits/fcntl2.h:53:14: note: called from here
   53 |       return __open_alias (__path, __oflag, __va_arg_pack ());
      |              ^
/usr/include/bits/fcntl2.h: In function ‘sysprof_capture_reader_new’:
/usr/include/bits/fcntl2.h:41:1: error: inlining failed in call to ‘always_inline’ ‘*open64.localalias’: function not inlinable
   41 | open (const char *__path, int __oflag, ...)
      | ^
/usr/include/bits/fcntl2.h:53:14: note: called from here
   53 |       return __open_alias (__path, __oflag, __va_arg_pack ());
      |              ^
make: *** [/var/tmp/portage/dev-util/sysprof-3.37.2/temp/cc4koOed.mk:2: /var/tmp/portage/dev-util/sysprof-3.37.2/temp/libsysprof-speedtrack-4.so.4EqYQe.ltrans0.ltrans.o] Error 1
lto-wrapper: fatal error: make returned 2 exit status
compilation terminated.
/usr/lib/gcc/x86_64-pc-linux-gnu/10.2.0/../../../../x86_64-pc-linux-gnu/bin/ld: error: lto-wrapper failed
collect2: error: ld returned 1 exit status
ninja: build stopped: subcommand failed.
 * ERROR: dev-util/sysprof-3.37.2::gnome-next failed (compile phase):
 *   ninja -v -j1 -l0 -C /var/tmp/portage/dev-util/sysprof-3.37.2/work/sysprof-3.37.2-build failed
 *
 * Call stack:
 *     ebuild.sh, line  125:  Called src_compile
 *   environment, line 3864:  Called meson_src_compile
 *   environment, line 3059:  Called eninja '-C' '/var/tmp/portage/dev-util/sysprof-3.37.2/work/sysprof-3.37.2-build'
 *   environment, line 2381:  Called die
 * The specific snippet of code:
 *       "$@" || die "${nonfatal_args[@]}" "${*} failed"
 *
 * If you need support, post the output of `emerge --info '=dev-util/sysprof-3.37.2::gnome-next'`,
 * the complete build log and the output of `emerge -pqv '=dev-util/sysprof-3.37.2::gnome-next'`.
 * The complete build log is located at '/var/tmp/portage/dev-util/sysprof-3.37.2/temp/build.log'.
 * The ebuild environment file is located at '/var/tmp/portage/dev-util/sysprof-3.37.2/temp/environment'.
 * Working directory: '/var/tmp/portage/dev-util/sysprof-3.37.2/work/sysprof-3.37.2'
 * S: '/var/tmp/portage/dev-util/sysprof-3.37.2/work/sysprof-3.37.2'

... ... ...

* genup: Warning: emerge did not complete successfully
* You can try to fix the problem in another console, then return here
* and resume the emerge
* Attempt to resume the emerge now (y/n)? n
* Quitting

_________________
Turn Left...
Back to top
View user's profile Send private message
Display posts from previous:   
Reply to topic    Gentoo Forums Forum Index Unsupported Software All times are GMT
Page 1 of 1

 
Jump to:  
You cannot post new topics in this forum
You cannot reply to topics in this forum
You cannot edit your posts in this forum
You cannot delete your posts in this forum
You cannot vote in polls in this forum