Gentoo Forums
Gentoo Forums
Gentoo Forums
Quick Search: in
dev-python/mpi4py-3.0.0 failed to merge (SOLUCIONADO)
View unanswered posts
View posts from last 24 hours

 
Reply to topic    Gentoo Forums Forum Index Spanish
View previous topic :: View next topic  
Author Message
pelelademadera
Veteran
Veteran


Joined: 14 Jul 2008
Posts: 1248
Location: La Plata, Argentina

PostPosted: Tue Jul 16, 2019 7:16 pm    Post subject: dev-python/mpi4py-3.0.0 failed to merge (SOLUCIONADO) Reply with quote

Buenas, tengo problemas con mp14py, todas sus versiones, lo estoy necesitando como dependencia de freecad, y la verdad no encuentro la solucion, probe recompilando las dependencias todo, el ebuild parece simple, pero no encuentro tampoco en los foros..

dejo el log:
Quote:
>>> Emerging (3 of 18) dev-python/mpi4py-3.0.0::gentoo
* mpi4py-3.0.0.tar.gz BLAKE2B SHA512 size ;-) ... [ ok ]
>>> Unpacking source...
>>> Unpacking mpi4py-3.0.0.tar.gz to /var/tmp/portage/dev-python/mpi4py-3.0.0/work
>>> Source unpacked in /var/tmp/portage/dev-python/mpi4py-3.0.0/work
>>> Preparing source in /var/tmp/portage/dev-python/mpi4py-3.0.0/work/mpi4py-3.0.0 ...
removed 'docs/source/usrman/citing.rst'
removed 'docs/source/usrman/index.rst'
removed 'docs/source/usrman/appendix.rst'
removed 'docs/source/usrman/intro.rst'
removed 'docs/source/usrman/make.bat'
removed 'docs/source/usrman/mpi4py.futures.rst'
removed 'docs/source/usrman/overview.rst'
removed 'docs/source/usrman/toctree.txt'
removed 'docs/source/usrman/mpi4py.run.rst'
removed 'docs/source/usrman/conf.py'
removed 'docs/source/usrman/abstract.txt'
removed 'docs/source/usrman/install.rst'
removed 'docs/source/usrman/Makefile'
removed 'docs/source/usrman/tutorial.rst'
removed 'docs/source/usrman/manual.rst'
removed directory 'docs/source/usrman'
removed directory 'docs/source'
* Will copy sources from /var/tmp/portage/dev-python/mpi4py-3.0.0/work/mpi4py-3.0.0
* python2_7: copying to /var/tmp/portage/dev-python/mpi4py-3.0.0/work/mpi4py-3.0.0-python2_7
* python3_5: copying to /var/tmp/portage/dev-python/mpi4py-3.0.0/work/mpi4py-3.0.0-python3_5
* python3_6: copying to /var/tmp/portage/dev-python/mpi4py-3.0.0/work/mpi4py-3.0.0-python3_6
>>> Source prepared.
>>> Configuring source in /var/tmp/portage/dev-python/mpi4py-3.0.0/work/mpi4py-3.0.0 ...
>>> Source configured.
>>> Compiling source in /var/tmp/portage/dev-python/mpi4py-3.0.0/work/mpi4py-3.0.0 ...
* python2_7: running distutils-r1_run_phase distutils-r1_python_compile
python2.7 setup.py build
running build
running build_src
running build_py
creating /var/tmp/portage/dev-python/mpi4py-3.0.0/work/mpi4py-3.0.0-python2_7/build/lib/mpi4py
copying src/mpi4py/__init__.py -> /var/tmp/portage/dev-python/mpi4py-3.0.0/work/mpi4py-3.0.0-python2_7/build/lib/mpi4py
copying src/mpi4py/run.py -> /var/tmp/portage/dev-python/mpi4py-3.0.0/work/mpi4py-3.0.0-python2_7/build/lib/mpi4py
copying src/mpi4py/__main__.py -> /var/tmp/portage/dev-python/mpi4py-3.0.0/work/mpi4py-3.0.0-python2_7/build/lib/mpi4py
copying src/mpi4py/bench.py -> /var/tmp/portage/dev-python/mpi4py-3.0.0/work/mpi4py-3.0.0-python2_7/build/lib/mpi4py
creating /var/tmp/portage/dev-python/mpi4py-3.0.0/work/mpi4py-3.0.0-python2_7/build/lib/mpi4py/futures
copying src/mpi4py/futures/__init__.py -> /var/tmp/portage/dev-python/mpi4py-3.0.0/work/mpi4py-3.0.0-python2_7/build/lib/mpi4py/futures
copying src/mpi4py/futures/__main__.py -> /var/tmp/portage/dev-python/mpi4py-3.0.0/work/mpi4py-3.0.0-python2_7/build/lib/mpi4py/futures
copying src/mpi4py/futures/aplus.py -> /var/tmp/portage/dev-python/mpi4py-3.0.0/work/mpi4py-3.0.0-python2_7/build/lib/mpi4py/futures
copying src/mpi4py/futures/pool.py -> /var/tmp/portage/dev-python/mpi4py-3.0.0/work/mpi4py-3.0.0-python2_7/build/lib/mpi4py/futures
copying src/mpi4py/futures/server.py -> /var/tmp/portage/dev-python/mpi4py-3.0.0/work/mpi4py-3.0.0-python2_7/build/lib/mpi4py/futures
copying src/mpi4py/futures/_base.py -> /var/tmp/portage/dev-python/mpi4py-3.0.0/work/mpi4py-3.0.0-python2_7/build/lib/mpi4py/futures
copying src/mpi4py/futures/_lib.py -> /var/tmp/portage/dev-python/mpi4py-3.0.0/work/mpi4py-3.0.0-python2_7/build/lib/mpi4py/futures
copying src/mpi4py/MPI.pxd -> /var/tmp/portage/dev-python/mpi4py-3.0.0/work/mpi4py-3.0.0-python2_7/build/lib/mpi4py
copying src/mpi4py/libmpi.pxd -> /var/tmp/portage/dev-python/mpi4py-3.0.0/work/mpi4py-3.0.0-python2_7/build/lib/mpi4py
copying src/mpi4py/__init__.pxd -> /var/tmp/portage/dev-python/mpi4py-3.0.0/work/mpi4py-3.0.0-python2_7/build/lib/mpi4py
creating /var/tmp/portage/dev-python/mpi4py-3.0.0/work/mpi4py-3.0.0-python2_7/build/lib/mpi4py/include
creating /var/tmp/portage/dev-python/mpi4py-3.0.0/work/mpi4py-3.0.0-python2_7/build/lib/mpi4py/include/mpi4py
copying src/mpi4py/include/mpi4py/mpi4py.h -> /var/tmp/portage/dev-python/mpi4py-3.0.0/work/mpi4py-3.0.0-python2_7/build/lib/mpi4py/include/mpi4py
copying src/mpi4py/include/mpi4py/mpi4py.MPI_api.h -> /var/tmp/portage/dev-python/mpi4py-3.0.0/work/mpi4py-3.0.0-python2_7/build/lib/mpi4py/include/mpi4py
copying src/mpi4py/include/mpi4py/mpi4py.MPI.h -> /var/tmp/portage/dev-python/mpi4py-3.0.0/work/mpi4py-3.0.0-python2_7/build/lib/mpi4py/include/mpi4py
copying src/mpi4py/include/mpi4py/mpi4py.i -> /var/tmp/portage/dev-python/mpi4py-3.0.0/work/mpi4py-3.0.0-python2_7/build/lib/mpi4py/include/mpi4py
copying src/mpi4py/include/mpi4py/mpi.pxi -> /var/tmp/portage/dev-python/mpi4py-3.0.0/work/mpi4py-3.0.0-python2_7/build/lib/mpi4py/include/mpi4py
warning: build_py: byte-compiling is disabled, skipping.

running build_clib
MPI configuration: [mpi] from 'mpi.cfg'
MPI C compiler: /usr/bin/mpicc
MPI C++ compiler: /usr/bin/mpicxx
MPI F compiler: /usr/bin/mpifort
MPI F90 compiler: /usr/bin/mpif90
MPI F77 compiler: /usr/bin/mpif77
checking for library 'lmpe' ...
/usr/bin/mpicc -march=native -O2 -fPIC -c _configtest.c -o _configtest.o
/usr/bin/mpicc -Wl,-O1 -Wl,--as-needed -march=native -O2 _configtest.o -llmpe -o _configtest
/usr/lib/gcc/x86_64-pc-linux-gnu/8.3.0/../../../../x86_64-pc-linux-gnu/bin/ld: cannot find -llmpe
collect2: error: ld returned 1 exit status
failure.
removing: _configtest.c _configtest.o
building 'mpe' dylib library
creating /var/tmp/portage/dev-python/mpi4py-3.0.0/work/mpi4py-3.0.0-python2_7/build/temp.linux-x86_64-2.7
creating /var/tmp/portage/dev-python/mpi4py-3.0.0/work/mpi4py-3.0.0-python2_7/build/temp.linux-x86_64-2.7/src
creating /var/tmp/portage/dev-python/mpi4py-3.0.0/work/mpi4py-3.0.0-python2_7/build/temp.linux-x86_64-2.7/src/lib-pmpi
/usr/bin/mpicc -march=native -O2 -fPIC -c src/lib-pmpi/mpe.c -o /var/tmp/portage/dev-python/mpi4py-3.0.0/work/mpi4py-3.0.0-python2_7/build/temp.linux-x86_64-2.7/src/lib-pmpi/mpe.o
creating /var/tmp/portage/dev-python/mpi4py-3.0.0/work/mpi4py-3.0.0-python2_7/build/lib/mpi4py/lib-pmpi
/usr/bin/mpicc -shared -Wl,-O1 -Wl,--as-needed -march=native -O2 /var/tmp/portage/dev-python/mpi4py-3.0.0/work/mpi4py-3.0.0-python2_7/build/temp.linux-x86_64-2.7/src/lib-pmpi/mpe.o -o /var/tmp/portage/dev-python/mpi4py-3.0.0/work/mpi4py-3.0.0-python2_7/build/lib/mpi4py/lib-pmpi/libmpe.so
checking for library 'vt-mpi' ...
/usr/bin/mpicc -march=native -O2 -fPIC -c _configtest.c -o _configtest.o
/usr/bin/mpicc -Wl,-O1 -Wl,--as-needed -march=native -O2 _configtest.o -lvt-mpi -o _configtest
/usr/lib/gcc/x86_64-pc-linux-gnu/8.3.0/../../../../x86_64-pc-linux-gnu/bin/ld: cannot find -lvt-mpi
collect2: error: ld returned 1 exit status
failure.
removing: _configtest.c _configtest.o
checking for library 'vt.mpi' ...
/usr/bin/mpicc -march=native -O2 -fPIC -c _configtest.c -o _configtest.o
/usr/bin/mpicc -Wl,-O1 -Wl,--as-needed -march=native -O2 _configtest.o -lvt.mpi -o _configtest
/usr/lib/gcc/x86_64-pc-linux-gnu/8.3.0/../../../../x86_64-pc-linux-gnu/bin/ld: cannot find -lvt.mpi
collect2: error: ld returned 1 exit status
failure.
removing: _configtest.c _configtest.o
building 'vt' dylib library
/usr/bin/mpicc -march=native -O2 -fPIC -c src/lib-pmpi/vt.c -o /var/tmp/portage/dev-python/mpi4py-3.0.0/work/mpi4py-3.0.0-python2_7/build/temp.linux-x86_64-2.7/src/lib-pmpi/vt.o
/usr/bin/mpicc -shared -Wl,-O1 -Wl,--as-needed -march=native -O2 /var/tmp/portage/dev-python/mpi4py-3.0.0/work/mpi4py-3.0.0-python2_7/build/temp.linux-x86_64-2.7/src/lib-pmpi/vt.o -o /var/tmp/portage/dev-python/mpi4py-3.0.0/work/mpi4py-3.0.0-python2_7/build/lib/mpi4py/lib-pmpi/libvt.so
checking for library 'vt-mpi' ...
/usr/bin/mpicc -march=native -O2 -fPIC -c _configtest.c -o _configtest.o
/usr/bin/mpicc -Wl,-O1 -Wl,--as-needed -march=native -O2 _configtest.o -lvt-mpi -o _configtest
/usr/lib/gcc/x86_64-pc-linux-gnu/8.3.0/../../../../x86_64-pc-linux-gnu/bin/ld: cannot find -lvt-mpi
collect2: error: ld returned 1 exit status
failure.
removing: _configtest.c _configtest.o
checking for library 'vt.mpi' ...
/usr/bin/mpicc -march=native -O2 -fPIC -c _configtest.c -o _configtest.o
/usr/bin/mpicc -Wl,-O1 -Wl,--as-needed -march=native -O2 _configtest.o -lvt.mpi -o _configtest
/usr/lib/gcc/x86_64-pc-linux-gnu/8.3.0/../../../../x86_64-pc-linux-gnu/bin/ld: cannot find -lvt.mpi
collect2: error: ld returned 1 exit status
failure.
removing: _configtest.c _configtest.o
building 'vt-mpi' dylib library
/usr/bin/mpicc -march=native -O2 -fPIC -c src/lib-pmpi/vt-mpi.c -o /var/tmp/portage/dev-python/mpi4py-3.0.0/work/mpi4py-3.0.0-python2_7/build/temp.linux-x86_64-2.7/src/lib-pmpi/vt-mpi.o
/usr/bin/mpicc -shared -Wl,-O1 -Wl,--as-needed -march=native -O2 /var/tmp/portage/dev-python/mpi4py-3.0.0/work/mpi4py-3.0.0-python2_7/build/temp.linux-x86_64-2.7/src/lib-pmpi/vt-mpi.o -o /var/tmp/portage/dev-python/mpi4py-3.0.0/work/mpi4py-3.0.0-python2_7/build/lib/mpi4py/lib-pmpi/libvt-mpi.so
checking for library 'vt-hyb' ...
/usr/bin/mpicc -march=native -O2 -fPIC -c _configtest.c -o _configtest.o
/usr/bin/mpicc -Wl,-O1 -Wl,--as-needed -march=native -O2 _configtest.o -lvt-hyb -o _configtest
/usr/lib/gcc/x86_64-pc-linux-gnu/8.3.0/../../../../x86_64-pc-linux-gnu/bin/ld: cannot find -lvt-hyb
collect2: error: ld returned 1 exit status
failure.
removing: _configtest.c _configtest.o
checking for library 'vt.ompi' ...
/usr/bin/mpicc -march=native -O2 -fPIC -c _configtest.c -o _configtest.o
/usr/bin/mpicc -Wl,-O1 -Wl,--as-needed -march=native -O2 _configtest.o -lvt.ompi -o _configtest
/usr/lib/gcc/x86_64-pc-linux-gnu/8.3.0/../../../../x86_64-pc-linux-gnu/bin/ld: cannot find -lvt.ompi
collect2: error: ld returned 1 exit status
failure.
removing: _configtest.c _configtest.o
building 'vt-hyb' dylib library
/usr/bin/mpicc -march=native -O2 -fPIC -c src/lib-pmpi/vt-hyb.c -o /var/tmp/portage/dev-python/mpi4py-3.0.0/work/mpi4py-3.0.0-python2_7/build/temp.linux-x86_64-2.7/src/lib-pmpi/vt-hyb.o
/usr/bin/mpicc -shared -Wl,-O1 -Wl,--as-needed -march=native -O2 /var/tmp/portage/dev-python/mpi4py-3.0.0/work/mpi4py-3.0.0-python2_7/build/temp.linux-x86_64-2.7/src/lib-pmpi/vt-hyb.o -o /var/tmp/portage/dev-python/mpi4py-3.0.0/work/mpi4py-3.0.0-python2_7/build/lib/mpi4py/lib-pmpi/libvt-hyb.so
running build_ext
MPI configuration: [mpi] from 'mpi.cfg'
MPI C compiler: /usr/bin/mpicc
MPI C++ compiler: /usr/bin/mpicxx
MPI F compiler: /usr/bin/mpifort
MPI F90 compiler: /usr/bin/mpif90
MPI F77 compiler: /usr/bin/mpif77
checking for dlopen() availability ...
checking for header 'dlfcn.h' ...
x86_64-pc-linux-gnu-gcc -march=native -O2 -fPIC -I/usr/include/python2.7 -c _configtest.c -o _configtest.o
success!
removing: _configtest.c _configtest.o
success!
checking for library 'dl' ...
x86_64-pc-linux-gnu-gcc -march=native -O2 -fPIC -I/usr/include/python2.7 -c _configtest.c -o _configtest.o
x86_64-pc-linux-gnu-gcc -Wl,-O1 -Wl,--as-needed -march=native -O2 _configtest.o -L/var/tmp/portage/dev-python/mpi4py-3.0.0/work/mpi4py-3.0.0-python2_7/build/temp.linux-x86_64-2.7 -ldl -o _configtest
success!
removing: _configtest.c _configtest.o _configtest
checking for function 'dlopen' ...
x86_64-pc-linux-gnu-gcc -march=native -O2 -fPIC -I/usr/include/python2.7 -c _configtest.c -o _configtest.o
x86_64-pc-linux-gnu-gcc -Wl,-O1 -Wl,--as-needed -march=native -O2 _configtest.o -L/var/tmp/portage/dev-python/mpi4py-3.0.0/work/mpi4py-3.0.0-python2_7/build/temp.linux-x86_64-2.7 -ldl -o _configtest
success!
removing: _configtest.c _configtest.o _configtest
building 'mpi4py.dl' extension
x86_64-pc-linux-gnu-gcc -march=native -O2 -fPIC -DHAVE_DLFCN_H=1 -DHAVE_DLOPEN=1 -I/usr/include/python2.7 -c src/dynload.c -o /var/tmp/portage/dev-python/mpi4py-3.0.0/work/mpi4py-3.0.0-python2_7/build/temp.linux-x86_64-2.7/src/dynload.o
x86_64-pc-linux-gnu-gcc -shared -Wl,-O1 -Wl,--as-needed -march=native -O2 /var/tmp/portage/dev-python/mpi4py-3.0.0/work/mpi4py-3.0.0-python2_7/build/temp.linux-x86_64-2.7/src/dynload.o -L/var/tmp/portage/dev-python/mpi4py-3.0.0/work/mpi4py-3.0.0-python2_7/build/temp.linux-x86_64-2.7 -ldl -lpython2.7 -o /var/tmp/portage/dev-python/mpi4py-3.0.0/work/mpi4py-3.0.0-python2_7/build/lib/mpi4py/dl.so
checking for MPI compile and link ...
/usr/bin/mpicc -march=native -O2 -fPIC -I/usr/include/python2.7 -c _configtest.c -o _configtest.o
success!
removing: _configtest.c _configtest.o
/usr/bin/mpicc -march=native -O2 -fPIC -I/usr/include/python2.7 -c _configtest.c -o _configtest.o
/usr/bin/mpicc -Wl,-O1 -Wl,--as-needed -march=native -O2 _configtest.o -L/var/tmp/portage/dev-python/mpi4py-3.0.0/work/mpi4py-3.0.0-python2_7/build/temp.linux-x86_64-2.7 -o _configtest
success!
removing: _configtest.c _configtest.o _configtest
checking for missing MPI functions/symbols ...
/usr/bin/mpicc -march=native -O2 -fPIC -I/usr/include/python2.7 -c _configtest.c -o _configtest.o
success!
removing: _configtest.c _configtest.o
checking for function 'MPI_Type_create_f90_integer' ...
/usr/bin/mpicc -march=native -O2 -fPIC -I/usr/include/python2.7 -c _configtest.c -o _configtest.o
/usr/bin/mpicc -Wl,-O1 -Wl,--as-needed -march=native -O2 _configtest.o -L/var/tmp/portage/dev-python/mpi4py-3.0.0/work/mpi4py-3.0.0-python2_7/build/temp.linux-x86_64-2.7 -o _configtest
success!
removing: _configtest.c _configtest.o _configtest
checking for function 'MPI_Type_create_f90_real' ...
/usr/bin/mpicc -march=native -O2 -fPIC -I/usr/include/python2.7 -c _configtest.c -o _configtest.o
/usr/bin/mpicc -Wl,-O1 -Wl,--as-needed -march=native -O2 _configtest.o -L/var/tmp/portage/dev-python/mpi4py-3.0.0/work/mpi4py-3.0.0-python2_7/build/temp.linux-x86_64-2.7 -o _configtest
success!
removing: _configtest.c _configtest.o _configtest
checking for function 'MPI_Type_create_f90_complex' ...
/usr/bin/mpicc -march=native -O2 -fPIC -I/usr/include/python2.7 -c _configtest.c -o _configtest.o
/usr/bin/mpicc -Wl,-O1 -Wl,--as-needed -march=native -O2 _configtest.o -L/var/tmp/portage/dev-python/mpi4py-3.0.0/work/mpi4py-3.0.0-python2_7/build/temp.linux-x86_64-2.7 -o _configtest
success!
removing: _configtest.c _configtest.o _configtest
checking for function 'MPI_Status_c2f' ...
/usr/bin/mpicc -march=native -O2 -fPIC -I/usr/include/python2.7 -c _configtest.c -o _configtest.o
/usr/bin/mpicc -Wl,-O1 -Wl,--as-needed -march=native -O2 _configtest.o -L/var/tmp/portage/dev-python/mpi4py-3.0.0/work/mpi4py-3.0.0-python2_7/build/temp.linux-x86_64-2.7 -o _configtest
success!
removing: _configtest.c _configtest.o _configtest
checking for function 'MPI_Status_f2c' ...
/usr/bin/mpicc -march=native -O2 -fPIC -I/usr/include/python2.7 -c _configtest.c -o _configtest.o
/usr/bin/mpicc -Wl,-O1 -Wl,--as-needed -march=native -O2 _configtest.o -L/var/tmp/portage/dev-python/mpi4py-3.0.0/work/mpi4py-3.0.0-python2_7/build/temp.linux-x86_64-2.7 -o _configtest
success!
removing: _configtest.c _configtest.o _configtest
checking for dlopen() availability ...
checking for header 'dlfcn.h' ...
/usr/bin/mpicc -march=native -O2 -fPIC -I/usr/include/python2.7 -c _configtest.c -o _configtest.o
success!
removing: _configtest.c _configtest.o
success!
checking for library 'dl' ...
/usr/bin/mpicc -march=native -O2 -fPIC -I/usr/include/python2.7 -c _configtest.c -o _configtest.o
/usr/bin/mpicc -Wl,-O1 -Wl,--as-needed -march=native -O2 _configtest.o -L/var/tmp/portage/dev-python/mpi4py-3.0.0/work/mpi4py-3.0.0-python2_7/build/temp.linux-x86_64-2.7 -ldl -o _configtest
success!
removing: _configtest.c _configtest.o _configtest
checking for function 'dlopen' ...
/usr/bin/mpicc -march=native -O2 -fPIC -I/usr/include/python2.7 -c _configtest.c -o _configtest.o
/usr/bin/mpicc -Wl,-O1 -Wl,--as-needed -march=native -O2 _configtest.o -L/var/tmp/portage/dev-python/mpi4py-3.0.0/work/mpi4py-3.0.0-python2_7/build/temp.linux-x86_64-2.7 -ldl -o _configtest
success!
removing: _configtest.c _configtest.o _configtest
building 'mpi4py.MPI' extension
/usr/bin/mpicc -march=native -O2 -fPIC -DHAVE_DLFCN_H=1 -DHAVE_DLOPEN=1 -I/usr/include/python2.7 -c src/MPI.c -o /var/tmp/portage/dev-python/mpi4py-3.0.0/work/mpi4py-3.0.0-python2_7/build/temp.linux-x86_64-2.7/src/MPI.o
In file included from /usr/include/mpi.h:10,
from src/mpi4py.MPI.c:523,
from src/MPI.c:4:
src/mpi4py.MPI.c: In function ‘__pyx_f_6mpi4py_3MPI_del_Datatype’:
src/mpi4py.MPI.c:15086:36: error: expected expression before ‘_Static_assert’
__pyx_t_1 = (((__pyx_v_ob[0]) == MPI_UB) != 0);
^~~~~~
src/mpi4py.MPI.c:15099:36: error: expected expression before ‘_Static_assert’
__pyx_t_1 = (((__pyx_v_ob[0]) == MPI_LB) != 0);
^~~~~~
src/mpi4py.MPI.c: In function ‘__pyx_pf_6mpi4py_3MPI_8Datatype_44Free’:
src/mpi4py.MPI.c:69477:17: error: expected expression before ‘_Static_assert’
__pyx_v_p = MPI_UB;
^~~~~~
src/mpi4py.MPI.c:69491:17: error: expected expression before ‘_Static_assert’
__pyx_v_p = MPI_LB;
^~~~~~
src/mpi4py.MPI.c: In function ‘__pyx_f_6mpi4py_3MPI_Datatype2String’:
src/mpi4py.MPI.c:76868:37: error: expected expression before ‘_Static_assert’
__pyx_t_1 = ((__pyx_v_datatype == MPI_LB) != 0);
^~~~~~
src/mpi4py.MPI.c:76881:37: error: expected expression before ‘_Static_assert’
__pyx_t_1 = ((__pyx_v_datatype == MPI_UB) != 0);
^~~~~~
src/mpi4py.MPI.c: In function ‘initMPI’:
src/mpi4py.MPI.c:167040:62: error: expected expression before ‘_Static_assert’
__pyx_t_3 = ((PyObject *)__pyx_f_6mpi4py_3MPI_new_Datatype(MPI_UB)); if (unlikely(!__pyx_t_3)) __PYX_ERR(21, 862, __pyx_L1_error)
^~~~~~
src/mpi4py.MPI.c:167054:62: error: expected expression before ‘_Static_assert’
__pyx_t_3 = ((PyObject *)__pyx_f_6mpi4py_3MPI_new_Datatype(MPI_LB)); if (unlikely(!__pyx_t_3)) __PYX_ERR(21, 863, __pyx_L1_error)
^~~~~~
error: command '/usr/bin/mpicc' failed with exit status 1
* ERROR: dev-python/mpi4py-3.0.0::gentoo failed (compile phase):
* (no error message)
*
* Call stack:
* ebuild.sh, line 125: Called src_compile
* environment, line 2674: Called distutils-r1_src_compile
* environment, line 854: Called _distutils-r1_run_foreach_impl 'distutils-r1_python_compile'
* environment, line 355: Called python_foreach_impl 'distutils-r1_run_phase' 'distutils-r1_python_compile'
* environment, line 2208: Called multibuild_foreach_variant '_python_multibuild_wrapper' 'distutils-r1_run_phase' 'distutils-r1_python_compile'
* environment, line 1568: Called _multibuild_run '_python_multibuild_wrapper' 'distutils-r1_run_phase' 'distutils-r1_python_compile'
* environment, line 1566: Called _python_multibuild_wrapper 'distutils-r1_run_phase' 'distutils-r1_python_compile'
* environment, line 572: Called distutils-r1_run_phase 'distutils-r1_python_compile'
* environment, line 845: Called distutils-r1_python_compile
* environment, line 715: Called esetup.py 'build'
* environment, line 1113: Called die
* The specific snippet of code:
* "${@}" || die "${die_args[@]}";
*
* If you need support, post the output of `emerge --info '=dev-python/mpi4py-3.0.0::gentoo'`,
* the complete build log and the output of `emerge -pqv '=dev-python/mpi4py-3.0.0::gentoo'`.
* The complete build log is located at '/var/tmp/portage/dev-python/mpi4py-3.0.0/temp/build.log'.
* The ebuild environment file is located at '/var/tmp/portage/dev-python/mpi4py-3.0.0/temp/environment'.
* Working directory: '/var/tmp/portage/dev-python/mpi4py-3.0.0/work/mpi4py-3.0.0-python2_7'
* S: '/var/tmp/portage/dev-python/mpi4py-3.0.0/work/mpi4py-3.0.0'

>>> Failed to emerge dev-python/mpi4py-3.0.0, Log file:

>>> '/var/tmp/portage/dev-python/mpi4py-3.0.0/temp/build.log'

* Messages for package dev-python/mpi4py-3.0.0:

* ERROR: dev-python/mpi4py-3.0.0::gentoo failed (compile phase):
* (no error message)
*
* Call stack:
* ebuild.sh, line 125: Called src_compile
* environment, line 2674: Called distutils-r1_src_compile
* environment, line 854: Called _distutils-r1_run_foreach_impl 'distutils-r1_python_compile'
* environment, line 355: Called python_foreach_impl 'distutils-r1_run_phase' 'distutils-r1_python_compile'
* environment, line 2208: Called multibuild_foreach_variant '_python_multibuild_wrapper' 'distutils-r1_run_phase' 'distutils-r1_python_compile'
* environment, line 1568: Called _multibuild_run '_python_multibuild_wrapper' 'distutils-r1_run_phase' 'distutils-r1_python_compile'
* environment, line 1566: Called _python_multibuild_wrapper 'distutils-r1_run_phase' 'distutils-r1_python_compile'
* environment, line 572: Called distutils-r1_run_phase 'distutils-r1_python_compile'
* environment, line 845: Called distutils-r1_python_compile
* environment, line 715: Called esetup.py 'build'
* environment, line 1113: Called die
* The specific snippet of code:
* "${@}" || die "${die_args[@]}";
*
* If you need support, post the output of `emerge --info '=dev-python/mpi4py-3.0.0::gentoo'`,
* the complete build log and the output of `emerge -pqv '=dev-python/mpi4py-3.0.0::gentoo'`.
* The complete build log is located at '/var/tmp/portage/dev-python/mpi4py-3.0.0/temp/build.log'.
* The ebuild environment file is located at '/var/tmp/portage/dev-python/mpi4py-3.0.0/temp/environment'.
* Working directory: '/var/tmp/portage/dev-python/mpi4py-3.0.0/work/mpi4py-3.0.0-python2_7'
* S: '/var/tmp/portage/dev-python/mpi4py-3.0.0/work/mpi4py-3.0.0'

* GNU info directory index is up-to-date.

_________________
el pelado de la gente
------
Los habitantes de las islas Malvinas lo llaman gentoo, nombre en el que se basa la distribución GNU/Linux Gentoo, cuyo objetivo es la optimización para conseguir más rendimiento y velocidad en la ejecución.
------


Last edited by pelelademadera on Tue Jul 16, 2019 9:45 pm; edited 1 time in total
Back to top
View user's profile Send private message
fedeliallalinea
Moderator
Moderator


Joined: 08 Mar 2003
Posts: 25901
Location: here

PostPosted: Tue Jul 16, 2019 7:23 pm    Post subject: Reply with quote

https://bugs.gentoo.org/685780
_________________
Questions are guaranteed in life; Answers aren't.
Back to top
View user's profile Send private message
pelelademadera
Veteran
Veteran


Joined: 14 Jul 2008
Posts: 1248
Location: La Plata, Argentina

PostPosted: Tue Jul 16, 2019 9:45 pm    Post subject: Reply with quote

fedeliallalinea wrote:
https://bugs.gentoo.org/685780


impecable sr. muchas gracias.

use el ultimo comment.
en mi overlay local use la version 3.0.2 y listo el pollo.

muchas gracias
_________________
el pelado de la gente
------
Los habitantes de las islas Malvinas lo llaman gentoo, nombre en el que se basa la distribución GNU/Linux Gentoo, cuyo objetivo es la optimización para conseguir más rendimiento y velocidad en la ejecución.
------
Back to top
View user's profile Send private message
Display posts from previous:   
Reply to topic    Gentoo Forums Forum Index Spanish All times are GMT
Page 1 of 1

 
Jump to:  
You cannot post new topics in this forum
You cannot reply to topics in this forum
You cannot edit your posts in this forum
You cannot delete your posts in this forum
You cannot vote in polls in this forum