Gentoo Forums
Gentoo Forums
Gentoo Forums
Quick Search: in
[Solved] Firefox 52.3.0 aarch64 compilation fails
View unanswered posts
View posts from last 24 hours

 
Reply to topic    Gentoo Forums Forum Index Gentoo on ARM
View previous topic :: View next topic  
Author Message
defoo
n00b
n00b


Joined: 25 Jul 2017
Posts: 30

PostPosted: Tue Sep 05, 2017 7:58 pm    Post subject: [Solved] Firefox 52.3.0 aarch64 compilation fails Reply with quote

Hi,

Both
Code:
FEATURES="-usersandbox -sandbox" emerge firefox

and
Code:
EXTRA_ECONF="--disable-content-sandbox" FEATURES="-sandbox -usersandbox" emerge firefox

failed.

emerge --info '=www-client/firefox-52.3.0::gentoo'
Code:
Portage 2.3.8 (python 3.4.6-final-0, default/linux/arm64/13.0/desktop, gcc-7.2.0, glibc-2.25-r4, 4.4.15 aarch64)
=================================================================
                         System Settings
=================================================================
System uname: Linux-4.4.15-aarch64-with-gentoo-2.4.1
KiB Mem:     8041164 total,   1756820 free
KiB Swap:    4193276 total,   4192472 free
Timestamp of repository gentoo: Tue, 05 Sep 2017 19:30:01 +0000
Head commit of repository gentoo: 9e0e1395d26965ff36730a54f9bf46ced110ce3b
sh bash 4.4_p12
ld GNU ld (Gentoo 2.28.1 p1.0) 2.28.1
app-shells/bash:          4.4_p12::gentoo
dev-lang/perl:            5.24.2::gentoo
dev-lang/python:          2.7.13::gentoo, 3.4.6::gentoo
dev-util/cmake:           3.9.1::gentoo
dev-util/pkgconfig:       0.29.2::gentoo
sys-apps/baselayout:      2.4.1-r2::gentoo
sys-apps/openrc:          0.29::gentoo
sys-apps/sandbox:         2.10-r4::gentoo
sys-devel/autoconf:       2.13::gentoo, 2.69-r4::gentoo
sys-devel/automake:       1.13.4-r1::gentoo, 1.15.1-r1::gentoo
sys-devel/binutils:       2.28.1::gentoo
sys-devel/gcc:            7.2.0::gentoo
sys-devel/gcc-config:     1.8-r1::gentoo
sys-devel/libtool:        2.4.6-r4::gentoo
sys-devel/make:           4.2.1-r1::gentoo
sys-kernel/linux-headers: 4.10::gentoo (virtual/os-headers)
sys-libs/glibc:           2.25-r4::gentoo
Repositories:

gentoo
    location: /usr/portage
    sync-type: rsync
    sync-uri: rsync://rsync.gentoo.org/gentoo-portage
    priority: -1000

ACCEPT_KEYWORDS="arm64 ~arm64"
ACCEPT_LICENSE="* -@EULA"
CBUILD="aarch64-unknown-linux-gnu"
CFLAGS="-O2 -pipe -march=native"
CHOST="aarch64-unknown-linux-gnu"
CONFIG_PROTECT="/etc /usr/share/config /usr/share/gnupg/qualified.txt"
CONFIG_PROTECT_MASK="/etc/ca-certificates.conf /etc/dconf /etc/env.d /etc/fonts/fonts.conf /etc/gconf /etc/gentoo-release /etc/revdep-rebuild /etc/sandbox.d /etc/terminfo"
CXXFLAGS="-O2"
DISTDIR="/usr/portage/distfiles"
FCFLAGS="-O2"
FEATURES="assume-digests binpkg-logs config-protect-if-modified distlocks ebuild-locks fixlafiles merge-sync multilib-strict news parallel-fetch preserve-libs protect-owned sandbox sfperms strict unknown-features-warn unmerge-logs unmerge-orphans userfetch userpriv usersandbox usersync xattr"
FFLAGS="-O2"
GENTOO_MIRRORS="http://distfiles.gentoo.org"
LANG="fr_FR.utf8"
LDFLAGS="-Wl,-O1 -Wl,--as-needed"
MAKEOPTS="-j7"
PKGDIR="/usr/portage/packages"
PORTAGE_CONFIGROOT="/"
PORTAGE_RSYNC_OPTS="--recursive --links --safe-links --perms --times --omit-dir-times --compress --force --whole-file --delete --stats --human-readable --timeout=180 --exclude=/distfiles --exclude=/local --exclude=/packages --exclude=/.git"
PORTAGE_TMPDIR="/var/tmp"
USE="X a52 aac acl acpi alsa arm64 berkdb bluetooth branding bzip2 cairo cdda cdr cli consolekit cracklib crypt cups cxx dbus dri dts dvdr emboss encode exif fam ffmpeg firefox flac fortran gdbm gif glamor gpm gtk iconv ipv6 jpeg lcms libnotify mad mng modules mp3 mp4 mpeg multilib ncurses neon nls nptl ogg opengl openmp pam pango pcre pdf png policykit ppds qt3support qt4 readline seccomp session spell ssl startup-notification svg tcpd tiff truetype udev udisks unicode upower usb vorbis wxwidgets x264 xattr xcb xml xv xvid zlib" APACHE2_MODULES="authn_core authz_core socache_shmcb unixd actions alias auth_basic authn_alias authn_anon authn_dbm authn_default authn_file authz_dbm authz_default authz_groupfile authz_host authz_owner authz_user autoindex cache cgi cgid dav dav_fs dav_lock deflate dir disk_cache env expires ext_filter file_cache filter headers include info log_config logio mem_cache mime mime_magic negotiation rewrite setenvif speling status unique_id userdir usertrack vhost_alias" CALLIGRA_FEATURES="kexi words flow plan sheets stage tables krita karbon braindump author" COLLECTD_PLUGINS="df interface irq load memory rrdtool swap syslog" CPU_FLAGS_ARM="edsp neon thumb thumb2 v4 v5 v6 v7 v8 vfp vfp-d32 vfpv3 vfpv4" ELIBC="glibc" GPSD_PROTOCOLS="ashtech aivdm earthmate evermore fv18 garmin garmintxt gpsclock isync itrax mtk3301 nmea ntrip navcom oceanserver oldstyle oncore rtcm104v2 rtcm104v3 sirf skytraq superstar2 timing tsip tripmate tnt ublox ubx" INPUT_DEVICES="evdev" KERNEL="linux" L10N="fr fr-FR en en-US" LCD_DEVICES="bayrad cfontz cfontz633 glk hd44780 lb216 lcdm001 mtxorb ncurses text" LIBREOFFICE_EXTENSIONS="presenter-console presenter-minimizer" LINGUAS="fr en" OFFICE_IMPLEMENTATION="libreoffice" PHP_TARGETS="php5-6" POSTGRES_TARGETS="postgres9_5" PYTHON_SINGLE_TARGET="python3_4" PYTHON_TARGETS="python2_7 python3_4" RUBY_TARGETS="ruby21 ruby22" USERLAND="GNU" VIDEO_CARDS="nouveau fbdev tegra" XTABLES_ADDONS="quota2 psd pknock lscan length2 ipv4options ipset ipp2p iface geoip fuzzy condition tee tarpit sysrq steal rawnat logmark ipmark dhcpmac delude chaos account"
Unset:  CC, CPPFLAGS, CTARGET, CXX, EMERGE_DEFAULT_OPTS, INSTALL_MASK, LC_ALL, PORTAGE_BUNZIP2_COMMAND, PORTAGE_COMPRESS, PORTAGE_COMPRESS_FLAGS, PORTAGE_RSYNC_EXTRA_OPTS


emerge -pqv '=www-client/firefox-52.3.0::gentoo'
Code:
[ebuild  N    ] www-client/firefox-52.3.0  USE="dbus gmp-autoupdate jemalloc startup-notification -bindist -custom-cflags -custom-optimization -debug -gtk2 (-hardened) -hwaccel -jack -neon (-pgo) -pulseaudio (-rust) (-selinux) (-system-cairo) -system-harfbuzz -system-icu -system-jpeg -system-libevent -system-libvpx -system-sqlite {-test} -wifi" L10N="fr -ach -af -an -ar -as -ast -az -bg -bn-BD -bn-IN -br -bs -ca -cak -cs -cy -da -de -dsb -el -en-GB -en-ZA -eo -es-AR -es-CL -es-ES -es-MX -et -eu -fa -ff -fi -fy -ga -gd -gl -gn -gu -he -hi -hr -hsb -hu -hy -id -is -it -ja -ka -kab -kk -km -kn -ko -lij -lt -lv -mai -mk -ml -mr -ms -nb -nl -nn -or -pa -pl -pt-BR -pt-PT -rm -ro -ru -si -sk -sl -son -sq -sr -sv -ta -te -th -tr -uk -uz -vi -xh -zh-CN -zh-TW"


/var/tmp/portage/www-client/firefox-52.3.0/temp/build.log
Code:
/var/tmp/portage/www-client/firefox-52.3.0/work/firefox-52.3.0esr/ff/_virtualenv/bin/python /var/tmp/portage/www-client/firefox-52.3.0/work/firefox-52.3.0esr/config/expandlibs_gen.py -o libmemory_mozalloc.a.desc Unified_cpp_memory_mozalloc0.o 
/var/tmp/portage/www-client/firefox-52.3.0/work/firefox-52.3.0esr/ipc/contentproc/plugin-container.cpp: In function 'int content_process_main(int, char**)':
/var/tmp/portage/www-client/firefox-52.3.0/work/firefox-52.3.0esr/ipc/contentproc/plugin-container.cpp:168:14: error: 'SandboxEarlyInit' is not a member of 'mozilla'
     mozilla::SandboxEarlyInit(XRE_GetProcessType());
              ^~~~~~~~~~~~~~~~
chmod +x libreplace_malloc.so
make[4]: *** [/var/tmp/portage/www-client/firefox-52.3.0/work/firefox-52.3.0esr/config/rules.mk:953: plugin-container.o] Error 1
make[4]: Leaving directory '/var/tmp/portage/www-client/firefox-52.3.0/work/firefox-52.3.0esr/ff/ipc/contentproc'
make[3]: *** [/var/tmp/portage/www-client/firefox-52.3.0/work/firefox-52.3.0esr/config/recurse.mk:71: ipc/contentproc/target] Error 2
make[3]: *** Waiting for unfinished jobs....
/usr/bin/aarch64-unknown-linux-gnu-gcc -std=gnu99 -o Unified_c_memory_jemalloc1.o -c -I/var/tmp/portage/www-client/firefox-52.3.0/work/firefox-52.3.0esr/ff/dist/system_wrappers -include /var/tmp/portage/www-client/firefox-52.3.0/work/firefox-52.3.0esr/config/gcc_hidden.h -DNDEBUG=1 -DTRIMMED=1 -D_GNU_SOURCE -Dabort=moz_abort -DMOZ_HAS_MOZGLUE -I/var/tmp/portage/www-client/firefox-52.3.0/work/firefox-52.3.0esr/memory/jemalloc -I/var/tmp/portage/www-client/firefox-52.3.0/work/firefox-52.3.0esr/ff/memory/jemalloc -I/var/tmp/portage/www-client/firefox-52.3.0/work/firefox-52.3.0esr/ff/memory/jemalloc/src/include -I/var/tmp/portage/www-client/firefox-52.3.0/work/firefox-52.3.0esr/memory/jemalloc/src/include -I/var/tmp/portage/www-client/firefox-52.3.0/work/firefox-52.3.0esr/ff/dist/include  -I/usr/include/nspr -I/usr/include/nss       -fPIC  -include /var/tmp/portage/www-client/firefox-52.3.0/work/firefox-52.3.0esr/ff/mozilla-config.h -DMOZILLA_CLIENT -MD -MP -MF .deps/Unified_c_memory_jemalloc1.o.pp  -Wall -Wempty-body -Wignored-qualifiers -Wpointer-arith -Wsign-compare -Wtype-limits -Wunreachable-code -Wno-error=maybe-uninitialized -Wno-error=deprecated-declarations -Wno-error=array-bounds -fno-lifetime-dse -pipe -march=native -fno-strict-aliasing -fno-math-errno -pthread -pipe  -O2 -fomit-frame-pointer -std=gnu99  /var/tmp/portage/www-client/firefox-52.3.0/work/firefox-52.3.0esr/ff/memory/jemalloc/Unified_c_memory_jemalloc1.c
../../../config/nsinstall -R -m 644 'libreplace_malloc.so' '../../../dist/bin'
make[4]: Leaving directory '/var/tmp/portage/www-client/firefox-52.3.0/work/firefox-52.3.0esr/ff/memory/replace/replace'
In file included from /var/tmp/portage/www-client/firefox-52.3.0/work/firefox-52.3.0esr/ff/memory/jemalloc/Unified_c_memory_jemalloc0.c:101:0:
/var/tmp/portage/www-client/firefox-52.3.0/work/firefox-52.3.0esr/memory/jemalloc/src/src/jemalloc.c: In function 'malloc_conf_init':
/var/tmp/portage/www-client/firefox-52.3.0/work/firefox-52.3.0esr/memory/jemalloc/src/src/jemalloc.c:1072:27: warning: comparison of unsigned expression < 0 is always false [-Wtype-limits]
      if ((min) != 0 && um < (min)) \
                           ^
/var/tmp/portage/www-client/firefox-52.3.0/work/firefox-52.3.0esr/memory/jemalloc/src/src/jemalloc.c:1093:4: note: in expansion of macro 'CONF_HANDLE_T_U'
    CONF_HANDLE_T_U(size_t, o, n, min, max, clip)
    ^~~~~~~~~~~~~~~
/var/tmp/portage/www-client/firefox-52.3.0/work/firefox-52.3.0esr/memory/jemalloc/src/src/jemalloc.c:1232:5: note: in expansion of macro 'CONF_HANDLE_SIZE_T'
     CONF_HANDLE_SIZE_T(opt_quarantine, "quarantine",
     ^~~~~~~~~~~~~~~~~~
/var/tmp/portage/www-client/firefox-52.3.0/work/firefox-52.3.0esr/memory/jemalloc/src/src/jemalloc.c:1079:28: warning: comparison of unsigned expression < 0 is always false [-Wtype-limits]
      if (((min) != 0 && um < (min)) \
                            ^
/var/tmp/portage/www-client/firefox-52.3.0/work/firefox-52.3.0esr/memory/jemalloc/src/src/jemalloc.c:1093:4: note: in expansion of macro 'CONF_HANDLE_T_U'
    CONF_HANDLE_T_U(size_t, o, n, min, max, clip)
    ^~~~~~~~~~~~~~~
/var/tmp/portage/www-client/firefox-52.3.0/work/firefox-52.3.0esr/memory/jemalloc/src/src/jemalloc.c:1232:5: note: in expansion of macro 'CONF_HANDLE_SIZE_T'
     CONF_HANDLE_SIZE_T(opt_quarantine, "quarantine",
     ^~~~~~~~~~~~~~~~~~
chmod +x libmozgtk.so
../../../../config/nsinstall -R -m 644 'libmozgtk.so' '../../../../dist/bin/gtk2'
make[4]: Leaving directory '/var/tmp/portage/www-client/firefox-52.3.0/work/firefox-52.3.0esr/ff/widget/gtk/mozgtk/gtk2'
/var/tmp/portage/www-client/firefox-52.3.0/work/firefox-52.3.0esr/memory/jemalloc/src/src/jemalloc.c:1072:27: warning: comparison of unsigned expression < 0 is always false [-Wtype-limits]
      if ((min) != 0 && um < (min)) \
                           ^
/var/tmp/portage/www-client/firefox-52.3.0/work/firefox-52.3.0esr/memory/jemalloc/src/src/jemalloc.c:1093:4: note: in expansion of macro 'CONF_HANDLE_T_U'
    CONF_HANDLE_T_U(size_t, o, n, min, max, clip)
    ^~~~~~~~~~~~~~~
/var/tmp/portage/www-client/firefox-52.3.0/work/firefox-52.3.0esr/memory/jemalloc/src/src/jemalloc.c:1269:5: note: in expansion of macro 'CONF_HANDLE_SIZE_T'
     CONF_HANDLE_SIZE_T(opt_lg_prof_sample,
     ^~~~~~~~~~~~~~~~~~
/var/tmp/portage/www-client/firefox-52.3.0/work/firefox-52.3.0esr/memory/jemalloc/src/src/jemalloc.c:1079:28: warning: comparison of unsigned expression < 0 is always false [-Wtype-limits]
      if (((min) != 0 && um < (min)) \
                            ^
/var/tmp/portage/www-client/firefox-52.3.0/work/firefox-52.3.0esr/memory/jemalloc/src/src/jemalloc.c:1093:4: note: in expansion of macro 'CONF_HANDLE_T_U'
    CONF_HANDLE_T_U(size_t, o, n, min, max, clip)
    ^~~~~~~~~~~~~~~
/var/tmp/portage/www-client/firefox-52.3.0/work/firefox-52.3.0esr/memory/jemalloc/src/src/jemalloc.c:1269:5: note: in expansion of macro 'CONF_HANDLE_SIZE_T'
     CONF_HANDLE_SIZE_T(opt_lg_prof_sample,
     ^~~~~~~~~~~~~~~~~~
make[4]: Leaving directory '/var/tmp/portage/www-client/firefox-52.3.0/work/firefox-52.3.0esr/ff/memory/mozalloc'
libfakeopenh264.so
rm -f libfakeopenh264.so
/var/tmp/portage/www-client/firefox-52.3.0/work/firefox-52.3.0esr/ff/_virtualenv/bin/python /var/tmp/portage/www-client/firefox-52.3.0/work/firefox-52.3.0esr/config/expandlibs_exec.py --uselist --  /usr/bin/aarch64-unknown-linux-gnu-g++ -std=gnu++11  -Wall -Wc++11-compat -Wempty-body -Wignored-qualifiers -Woverloaded-virtual -Wpointer-arith -Wsign-compare -Wtype-limits -Wunreachable-code -Wwrite-strings -Wno-invalid-offsetof -Wc++14-compat -Wc++1z-compat -Wimplicit-fallthrough -Wno-error=maybe-uninitialized -Wno-error=deprecated-declarations -Wno-error=array-bounds -fno-lifetime-dse -fno-delete-null-pointer-checks -fno-lifetime-dse -fno-schedule-insns2 -fno-exceptions -fno-strict-aliasing -fno-rtti -fno-exceptions -fno-math-errno -pthread -pipe  -O2 -fomit-frame-pointer  -fPIC -shared -Wl,-z,defs -Wl,-h,libfakeopenh264.so -o libfakeopenh264.so  gmp-fake-openh264.o   -lpthread -Wl,-O1 -Wl,--as-needed -Wl,-rpath=/usr/lib64/firefox,--enable-new-dtags -Wl,-z,noexecstack -Wl,-z,text   -Wl,-rpath-link,/var/tmp/portage/www-client/firefox-52.3.0/work/firefox-52.3.0esr/ff/dist/bin -Wl,-rpath-link,/usr/lib         -ldl 
In file included from /var/tmp/portage/www-client/firefox-52.3.0/work/firefox-52.3.0esr/ff/memory/jemalloc/Unified_c_memory_jemalloc1.c:83:0:
/var/tmp/portage/www-client/firefox-52.3.0/work/firefox-52.3.0esr/memory/jemalloc/src/src/util.c:5:0: warning: "assert" redefined
 #define assert(e) do {       \
 
In file included from /var/tmp/portage/www-client/firefox-52.3.0/work/firefox-52.3.0esr/memory/jemalloc/src/include/jemalloc/internal/util.h:78:0,
                 from /var/tmp/portage/www-client/firefox-52.3.0/work/firefox-52.3.0esr/ff/memory/jemalloc/src/include/jemalloc/internal/jemalloc_internal.h:370,
                 from /var/tmp/portage/www-client/firefox-52.3.0/work/firefox-52.3.0esr/memory/jemalloc/src/src/prng.c:2,
                 from /var/tmp/portage/www-client/firefox-52.3.0/work/firefox-52.3.0esr/ff/memory/jemalloc/Unified_c_memory_jemalloc1.c:2:
/var/tmp/portage/www-client/firefox-52.3.0/work/firefox-52.3.0esr/memory/jemalloc/src/include/jemalloc/internal/assert.h:6:0: note: this is the location of the previous definition
 #define assert(e) do {       \
 
In file included from /var/tmp/portage/www-client/firefox-52.3.0/work/firefox-52.3.0esr/ff/memory/jemalloc/Unified_c_memory_jemalloc1.c:83:0:
/var/tmp/portage/www-client/firefox-52.3.0/work/firefox-52.3.0esr/memory/jemalloc/src/src/util.c:12:0: warning: "not_reached" redefined
 #define not_reached() do {      \
 
In file included from /var/tmp/portage/www-client/firefox-52.3.0/work/firefox-52.3.0esr/memory/jemalloc/src/include/jemalloc/internal/util.h:78:0,
                 from /var/tmp/portage/www-client/firefox-52.3.0/work/firefox-52.3.0esr/ff/memory/jemalloc/src/include/jemalloc/internal/jemalloc_internal.h:370,
                 from /var/tmp/portage/www-client/firefox-52.3.0/work/firefox-52.3.0esr/memory/jemalloc/src/src/prng.c:2,
                 from /var/tmp/portage/www-client/firefox-52.3.0/work/firefox-52.3.0esr/ff/memory/jemalloc/Unified_c_memory_jemalloc1.c:2:
/var/tmp/portage/www-client/firefox-52.3.0/work/firefox-52.3.0esr/memory/jemalloc/src/include/jemalloc/internal/assert.h:17:0: note: this is the location of the previous definition
 #define not_reached() do {      \
 
In file included from /var/tmp/portage/www-client/firefox-52.3.0/work/firefox-52.3.0esr/ff/memory/jemalloc/Unified_c_memory_jemalloc1.c:83:0:
/var/tmp/portage/www-client/firefox-52.3.0/work/firefox-52.3.0esr/memory/jemalloc/src/src/util.c:20:0: warning: "not_implemented" redefined
 #define not_implemented() do {      \
 
In file included from /var/tmp/portage/www-client/firefox-52.3.0/work/firefox-52.3.0esr/memory/jemalloc/src/include/jemalloc/internal/util.h:78:0,
                 from /var/tmp/portage/www-client/firefox-52.3.0/work/firefox-52.3.0esr/ff/memory/jemalloc/src/include/jemalloc/internal/jemalloc_internal.h:370,
                 from /var/tmp/portage/www-client/firefox-52.3.0/work/firefox-52.3.0esr/memory/jemalloc/src/src/prng.c:2,
                 from /var/tmp/portage/www-client/firefox-52.3.0/work/firefox-52.3.0esr/ff/memory/jemalloc/Unified_c_memory_jemalloc1.c:2:
/var/tmp/portage/www-client/firefox-52.3.0/work/firefox-52.3.0esr/memory/jemalloc/src/include/jemalloc/internal/assert.h:29:0: note: this is the location of the previous definition
 #define not_implemented() do {      \
 
chmod +x libfakeopenh264.so
../../../config/nsinstall -R -m 644 'libfakeopenh264.so' '../../../dist/bin/gmp-fakeopenh264/1.0'
make[4]: Leaving directory '/var/tmp/portage/www-client/firefox-52.3.0/work/firefox-52.3.0esr/ff/dom/media/gmp-plugin-openh264'
libmemory_jemalloc.a
rm -f libmemory_jemalloc.a libmemory_jemalloc.a.desc
/var/tmp/portage/www-client/firefox-52.3.0/work/firefox-52.3.0esr/ff/_virtualenv/bin/python /var/tmp/portage/www-client/firefox-52.3.0/work/firefox-52.3.0esr/config/expandlibs_exec.py --extract -- ar crs libmemory_jemalloc.a ctl.o Unified_c_memory_jemalloc0.o Unified_c_memory_jemalloc1.o 
libmemory_jemalloc.a.desc
/var/tmp/portage/www-client/firefox-52.3.0/work/firefox-52.3.0esr/ff/_virtualenv/bin/python /var/tmp/portage/www-client/firefox-52.3.0/work/firefox-52.3.0esr/config/expandlibs_gen.py -o libmemory_jemalloc.a.desc ctl.o Unified_c_memory_jemalloc0.o Unified_c_memory_jemalloc1.o 
../../config/nsinstall -R -m 644 'libmemory_jemalloc.a' '../../dist/sdk/lib'
make[4]: Leaving directory '/var/tmp/portage/www-client/firefox-52.3.0/work/firefox-52.3.0esr/ff/memory/jemalloc'
make[3]: Leaving directory '/var/tmp/portage/www-client/firefox-52.3.0/work/firefox-52.3.0esr/ff'
make[2]: *** [/var/tmp/portage/www-client/firefox-52.3.0/work/firefox-52.3.0esr/config/recurse.mk:33: compile] Error 2
make[2]: Leaving directory '/var/tmp/portage/www-client/firefox-52.3.0/work/firefox-52.3.0esr/ff'
make[1]: *** [/var/tmp/portage/www-client/firefox-52.3.0/work/firefox-52.3.0esr/config/rules.mk:523: default] Error 2
make[1]: Leaving directory '/var/tmp/portage/www-client/firefox-52.3.0/work/firefox-52.3.0esr/ff'
make: *** [client.mk:415: realbuild] Error 2
 * ERROR: www-client/firefox-52.3.0::gentoo failed (compile phase):
 *   emake failed
 *
 * If you need support, post the output of `emerge --info '=www-client/firefox-52.3.0::gentoo'`,
 * the complete build log and the output of `emerge -pqv '=www-client/firefox-52.3.0::gentoo'`.
 * The complete build log is located at '/var/tmp/portage/www-client/firefox-52.3.0/temp/build.log'.
 * The ebuild environment file is located at '/var/tmp/portage/www-client/firefox-52.3.0/temp/environment'.
 * Working directory: '/var/tmp/portage/www-client/firefox-52.3.0/work/firefox-52.3.0esr'
 * S: '/var/tmp/portage/www-client/firefox-52.3.0/work/firefox-52.3.0esr'


Last edited by defoo on Fri Sep 08, 2017 8:06 am; edited 1 time in total
Back to top
View user's profile Send private message
Maxxx
Guru
Guru


Joined: 12 Jan 2016
Posts: 572
Location: Italia

PostPosted: Thu Sep 07, 2017 1:46 pm    Post subject: Reply with quote

Try to emerge with USE "-pgo"
Back to top
View user's profile Send private message
defoo
n00b
n00b


Joined: 25 Jul 2017
Posts: 30

PostPosted: Fri Sep 08, 2017 8:05 am    Post subject: Reply with quote

It worked !

Thanks for the tip.
Back to top
View user's profile Send private message
Display posts from previous:   
Reply to topic    Gentoo Forums Forum Index Gentoo on ARM All times are GMT
Page 1 of 1

 
Jump to:  
You cannot post new topics in this forum
You cannot reply to topics in this forum
You cannot edit your posts in this forum
You cannot delete your posts in this forum
You cannot vote in polls in this forum